{"text_format":"2","workbook":"xlsx","n_sheets":3,"sheets":["Results","Leader Board","Raw Data"],"not_rendered":{"charts":0,"images":1,"macros":0,"external_links":0,"defined_names":26,"comments":0,"pivot_tables":0},"unopened":[],"bounds":{"document_bytes":16777216,"sheet_cells":100000,"run_cost":"one","rows_first":2000,"rows_last":500,"rows_between":2000,"halvings":0,"cell_chars":16384,"cell_head_chars":4096},"cells_cut":0,"cells_raw":0,"read":"whole","date_system":"1900"}

{"sheet":"Results","index":0,"n_rows":33,"n_cols":212,"rows_kept":33,"cut":false,"hidden":false,"merged":[[2,41,2,47],[2,48,2,54],[2,55,2,61],[2,97,2,103],[2,62,2,68],[1,139,1,145],[2,139,2,145],[1,118,1,124],[2,118,2,124],[1,125,1,131],[2,125,2,131],[1,132,1,138],[2,132,2,138],[1,104,1,110],[2,6,2,12],[2,13,2,19],[2,20,2,26],[2,27,2,33],[2,34,2,40],[1,69,1,75],[1,76,1,82],[1,83,1,89],[2,104,2,110],[1,48,1,54],[1,55,1,61],[1,62,1,68],[1,97,1,103],[2,69,2,75],[2,76,2,82],[2,83,2,89],[2,90,2,96],[1,111,1,117],[2,111,2,117],[2,1,2,5],[1,27,1,33],[1,34,1,40],[1,6,1,12],[1,13,1,19],[1,20,1,26],[1,90,1,96],[1,41,1,47]]}
[null,{"$f":"4+99-COUNTIF(B5:B103,\"\")","v":33},null,{"$f":"MIN(INDIRECT(EQ1,TRUE))","v":31.67},null,{"$f":"IF($C$2<4,\"\",IF(AND($C$2>=4,$C$2<15),1,2))","v":1},{"$f":"MIN(G5:G103)","v":38.700000000000003},null,null,{"$f":"ADDRESS(B1,COLUMN()+1,4,1)","v":"K33"},null,null,{"$f":"ADDRESS(B1,COLUMN()-1,4,1)","v":"L33"},{"$f":"MIN(N5:N103)","v":42.74},null,null,{"$f":"ADDRESS(B1,COLUMN()+1,4,1)","v":"R33"},null,null,{"$f":"ADDRESS(B1,COLUMN()-1,4,1)","v":"S33"},{"$f":"MIN(U5:U103)","v":40.96},null,null,{"$f":"ADDRESS(B1,COLUMN()+1,4,1)","v":"Y33"},null,null,{"$f":"ADDRESS(B1,COLUMN()-1,4,1)","v":"Z33"},{"$f":"MIN(AB5:AB103)","v":43.29},null,null,{"$f":"ADDRESS(B1,COLUMN()+1,4,1)","v":"AF33"},null,null,{"$f":"ADDRESS(B1,COLUMN()-1,4,1)","v":"AG33"},{"$f":"MIN(AI5:AI103)","v":33.15},null,null,{"$f":"ADDRESS(B1,COLUMN()+1,4,1)","v":"AM33"},null,null,{"$f":"ADDRESS(B1,COLUMN()-1,4,1)","v":"AN33"},{"$f":"MIN(AP5:AP103)","v":36.82},null,null,{"$f":"ADDRESS(B1,COLUMN()+1,4,1)","v":"AT33"},null,null,{"$f":"ADDRESS(B1,COLUMN()-1,4,1)","v":"AU33"},{"$f":"MIN(AW5:AW103)","v":31.67},null,null,{"$f":"ADDRESS(B1,COLUMN()+1,4,1)","v":"BA33"},null,null,{"$f":"ADDRESS(B1,COLUMN()-1,4,1)","v":"BB33"},{"$f":"MIN(BD5:BD103)","v":35.130000000000003},null,null,{"$f":"ADDRESS(B1,COLUMN()+1,4,1)","v":"BH33"},null,null,{"$f":"ADDRESS(B1,COLUMN()-1,4,1)","v":"BI33"},{"$f":"MIN(BK5:BK103)","v":35.14},null,null,{"$f":"ADDRESS(B1,COLUMN()+1,4,1)","v":"BO33"},null,null,{"$f":"ADDRESS(B1,COLUMN()-1,4,1)","v":"BP33"},{"$f":"MIN(BR5:BR103)","v":38.909999999999997},null,null,{"$f":"ADDRESS(B1,COLUMN()+1,4,1)","v":"BV33"},null,null,{"$f":"ADDRESS(B1,COLUMN()-1,4,1)","v":"BW33"},{"$f":"MIN(BY5:BY103)","v":36.090000000000003},null,null,{"$f":"ADDRESS(B1,COLUMN()+1,4,1)","v":"CC33"},null,null,{"$f":"ADDRESS(B1,COLUMN()-1,4,1)","v":"CD33"},{"$f":"MIN(CF5:CF103)","v":35.36},null,null,{"$f":"ADDRESS(B1,COLUMN()+1,4,1)","v":"CJ33"},null,null,{"$f":"ADDRESS(B1,COLUMN()-1,4,1)","v":"CK33"},{"$f":"MIN(CM5:CM103)","v":40.840000000000003},null,null,{"$f":"ADDRESS(B1,COLUMN()+1,4,1)","v":"CQ33"},null,null,{"$f":"ADDRESS(B1,COLUMN()-1,4,1)","v":"CR33"},{"$f":"MIN(CT5:CT103)","v":40.32},null,null,{"$f":"ADDRESS(B1,COLUMN()+1,4,1)","v":"CX33"},null,null,{"$f":"ADDRESS(B1,COLUMN()-1,4,1)","v":"CY33"},{"$f":"MIN(DA5:DA103)","v":0},null,null,{"$f":"ADDRESS(B1,COLUMN()+1,4,1)","v":"DE33"},null,null,{"$f":"ADDRESS(B1,COLUMN()-1,4,1)","v":"DF33"},{"$f":"MIN(DH5:DH103)","v":0},null,null,{"$f":"ADDRESS(B1,COLUMN()+1,4,1)","v":"DL33"},null,null,{"$f":"ADDRESS(B1,COLUMN()-1,4,1)","v":"DM33"},{"$f":"MIN(DO5:DO103)","v":0},null,null,{"$f":"ADDRESS(B1,COLUMN()+1,4,1)","v":"DS33"},null,null,{"$f":"ADDRESS(B1,COLUMN()-1,4,1)","v":"DT33"},{"$f":"MIN(DV5:DV103)","v":0},null,null,{"$f":"ADDRESS(B1,COLUMN()+1,4,1)","v":"DZ33"},null,null,{"$f":"ADDRESS(B1,COLUMN()-1,4,1)","v":"EA33"},{"$f":"MIN(EC5:EC103)","v":0},null,null,{"$f":"ADDRESS(B1,COLUMN()+1,4,1)","v":"EG33"},null,null,{"$f":"ADDRESS(B1,COLUMN()-1,4,1)","v":"EH33"},{"$f":"MIN(EJ5:EJ103)","v":0},null,null,{"$f":"ADDRESS(B1,COLUMN()+1,4,1)","v":"EN33"},null,null,{"$f":"ADDRESS(B1,COLUMN()-1,4,1)","v":"EO33"},{"$f":"ADDRESS(ROW(),COLUMN()+1,1,TRUE)&\":\"&ADDRESS(ROW(),COLUMN()+$C$2,1,TRUE)","v":"$ER$1:$FE$1"},{"$f":"G1","v":38.700000000000003},{"$f":"N1","v":42.74},{"$f":"U1","v":40.96},{"$f":"AB1","v":43.29},{"$f":"AI1","v":33.15},{"$f":"AP1","v":36.82},{"$f":"AW1","v":31.67},{"$f":"BD1","v":35.130000000000003},{"$f":"BK1","v":35.14},{"$f":"BR1","v":38.909999999999997},{"$f":"BY1","v":36.090000000000003},{"$f":"CF1","v":35.36},{"$f":"CM1","v":40.840000000000003},{"$f":"CT1","v":40.32},{"$f":"DA1","v":0},{"$f":"DH1","v":0},{"$f":"DO1","v":0},{"$f":"DV1","v":0},{"$f":"EC1","v":0},{"$f":"EJ1","v":0},{"$nulls":21},{"$f":"ADDRESS(ROW(),COLUMN()+$C$2,1,TRUE)","v":"$GU$1"},{"$f":"'Raw Data'!D1","v":0},{"$f":"'Raw Data'!F1","v":0},{"$f":"'Raw Data'!H1","v":0},{"$f":"'Raw Data'!J1","v":1},{"$f":"'Raw Data'!L1","v":1},{"$f":"'Raw Data'!N1","v":1},{"$f":"'Raw Data'!P1","v":1},{"$f":"'Raw Data'!R1","v":1},{"$f":"'Raw Data'!T1","v":1},{"$f":"'Raw Data'!V1","v":1},{"$f":"'Raw Data'!X1","v":1},{"$f":"'Raw Data'!Z1","v":1},{"$f":"'Raw Data'!AB1","v":1},{"$f":"'Raw Data'!AD1","v":1},{"$f":"'Raw Data'!AF1","v":2},{"$f":"'Raw Data'!AH1","v":2},{"$f":"'Raw Data'!AJ1","v":2},{"$f":"'Raw Data'!AL1","v":2},{"$f":"'Raw Data'!AN1","v":2},{"$f":"'Raw Data'!AP1","v":2},null,{"$f":"ADDRESS(B1,COLUMN()-1,4,1)","v":"HB33"}]
[null,"Rounds Complete",14,null,null,null,"Round 1 ",{"$nulls":6},"Round 2 ",{"$nulls":6},"Round 3 ",{"$nulls":6},"Round 4 (1 Discard Active)",{"$nulls":6},"Round 5 (1 Discard Active)",{"$nulls":6},"Round 6 (1 Discard Active)",{"$nulls":6},"Round 7 (1 Discard Active)",{"$nulls":6},"Round 8 (1 Discard Active)",{"$nulls":6},"Round 9 (1 Discard Active)",{"$nulls":6},"Round 10 (1 Discard Active)",{"$nulls":6},"Round 11 (1 Discard Active)",{"$nulls":6},"Round 12 (1 Discard Active)",{"$nulls":6},"Round 13 (1 Discard Active)",{"$nulls":6},"Round 14 (1 Discard Active)",{"$nulls":6},"Round 15 (2 Discards Active)",{"$nulls":6},"Round 16 (2 Discards Active)",{"$nulls":6},"Round 17 (2 Discards Active)",{"$nulls":6},"Round 18 (2 Discards Active)",{"$nulls":6},"Round 19 (2 Discards Active)",{"$nulls":6},"Round 20 (2 Discards Active)",{"$nulls":7},"Mark Redsell","Joel West","Aleix Ingles Elias","David Rumble","Joel West","Frits Donker Duyvis","Joel West","Joel West","Joel West","Les Wood","Joel West","Joel West","Stefan Bernardy","Mark Treble",{"$error":"#N/A"},{"$error":"#N/A"},{"$error":"#N/A"},{"$error":"#N/A"},{"$error":"#N/A"},{"$error":"#N/A"}]
[null,"Fastest Time of the day 31.67 by Joel West",{"$nulls":4},"Fastest Time 38.70 by Mark Redsell",{"$nulls":6},"Fastest Time 42.74 by Joel West",{"$nulls":6},"Fastest Time 40.96 by Aleix Ingles Elias",{"$nulls":6},"Fastest Time 43.29 by David Rumble",{"$nulls":6},"Fastest Time 33.15 by Joel West",{"$nulls":6},"Fastest Time 36.82 by Frits Donker Duyvis",{"$nulls":6},"Fastest Time 31.67 by Joel West",{"$nulls":6},"Fastest Time 35.13 by Joel West",{"$nulls":6},"Fastest Time 35.14 by Joel West",{"$nulls":6},"Fastest Time 38.91 by Les Wood",{"$nulls":6},"Fastest Time 36.09 by Joel West",{"$nulls":6},"Fastest Time 35.36 by Joel West",{"$nulls":6},"Fastest Time 40.84 by Stefan Bernardy",{"$nulls":6},"Fastest Time 40.32 by Mark Treble",{"$nulls":6},"",{"$nulls":6},"",{"$nulls":6},"",{"$nulls":6},"",{"$nulls":6},"",{"$nulls":6},""]
["Number","Pilots Name","Frequency","Total Score","Rank","Discard Rounds","Time","Penalty","FAI","Rank in Round 1","Work Total Rd 1","FAI Subtotal","Rank to Round 1","Time","Penalty","FAI","Rank in Round 2","Work Total Rd 2","FAI Subtotal","Rank to Round 2","Time","Penalty","FAI","Rank in Round 3","Work Total Rd 3","FAI Subtotal","Rank to Round 3","Time","Penalty","FAI","Rank in Round 4","Work Total Rd 4","FAI Subtotal","Rank to Round 4","Time","Penalty","FAI","Rank in Round 5","Work Total Rd 5","FAI Subtotal","Rank to Round 5","Time","Penalty","FAI","Rank in Round 6","Work Total Rd 6","FAI Subtotal","Rank to Round 6","Time","Penalty","FAI","Rank in Round 7","Work Total Rd 7","FAI Subtotal","Rank to Round 7","Time","Penalty","FAI","Rank in Round 8","Work Total Rd 8","FAI Subtotal","Rank to Round 8","Time","Penalty","FAI","Rank in Round 9","Work Total Rd 9","FAI Subtotal","Rank to Round 9","Time","Penalty","FAI","Rank in Round 10","Work Total Rd 10","FAI Subtotal","Rank to Round 10","Time","Penalty","FAI","Rank in Round 11","Work Total Rd 11","FAI Subtotal","Rank to Round 11","Time","Penalty","FAI","Rank in Round 12","Work Total Rd 12","FAI Subtotal","Rank to Round 12","Time","Penalty","FAI","Rank in Round 13","Work Total Rd 13","FAI Subtotal","Rank to Round 13","Time","Penalty","FAI","Rank in Round 14","Work Total Rd 14","FAI Subtotal","Rank to Round 14","Time","Penalty","FAI","Rank in Round 15","Work Total Rd 15","FAI Subtotal","Rank to Round 15","Time","Penalty","FAI","Rank in Round 16","Work Total Rd 16","FAI Subtotal","Rank to Round 16","Time","Penalty","FAI","Rank in Round 17","Work Total Rd 17","FAI Subtotal","Rank to Round 17","Time","Penalty","FAI","Rank in Round 18","Work Total Rd 18","FAI Subtotal","Rank to Round 18","Time","Penalty","FAI","Rank in Round 19","Work Total Rd 19","FAI Subtotal","Rank to Round 19","Time","Penalty","FAI","Rank in Round 20","Work Total Rd 20","FAI Subtotal","Rank to Round 20","Score Range","R1 Score","R2 Score","R3 Score","R4 Score","R5 Score","R6 Score","R7 Score","R8 Score","R9 Score","R10 Score","R11 Score","R12 Score","R13 Score","R14 Score","R15 Score","R16 Score","R17 Score","R18 Score","R19 Score","R20 Score","Penalties Range","R1 Penalties","R2 Penalties","R3 Penalties","R4 Penalties","R5 Penalties","R6 Penalties","R7 Penalties","R8 Penalties","R9 Penalties","R10 Penalties","R11 Penalties","R12 Penalties","R13 Penalties","R14 Penalties","R15 Penalties","R16 Penalties","R17 Penalties","R18 Penalties","R19 Penalties","R20 Penalties","Discard Total Cell","Discard Value","Discard Value","Discard Value","Discard Value","Discard Value","Discard Value","Discard Value","Discard Value","Discard Value","Discard Value","Discard Value","Discard Value","Discard Value","Discard Value","Discard Value","Discard Value","Discard Value","Discard Value","Discard Value","Discard Value","Total","Rank","Discard Rounds"]
[1,"Frits Donker Duyvis",0,10800.95,11,"7",51.88,"",745.95,19,745.95,745.95,19,57.16,"",747.72,22,747.72,1493.67,19,54.11,"",756.97,25,756.97,2250.64,25,47.33,"",914.64,6,914.64,2419.33,25,36.39,"",910.96,4,910.96,3330.29,17,36.82,"",1000,1,1000,4330.29,8,47.42,"",667.86,25,667.86,5076.24,12,41.88,"",838.82,9,838.82,5915.06,10,42.36,"",829.55,11,829.55,6744.61,10,45.58,"",853.66,15,853.66,7598.27,11,42.91,"",841.06,6,841.06,8439.33,10,49.01,"",721.48,12,721.48,9160.81,11,50.71,"",805.36,15,805.36,9966.17,11,48.3,"",834.78,8,834.78,10800.95,11,"","","","","","","","","","","","","","","","","","","","","","","","","","","","","","","","","","","","","","","","","","","$ER$5:$FE$5",745.95,747.72,756.97,914.64,910.96,1000,667.86,838.82,829.55,853.66,841.06,721.48,805.36,834.78,0,0,0,0,0,0,"$FM$5:$FZ$5",0,0,0,0,0,0,0,0,0,0,0,0,0,0,0,0,0,0,0,0,"GU5",0,0,0,745.95,745.95,745.95,667.86,667.86,667.86,667.86,667.86,667.86,667.86,667.86,667.86,0,0,0,0,0,10800.95,11,"7"]
[2,"Peter Gunning",0,10749.74,13,"2",50.43,"",767.4,16,767.4,767.4,16,59.6,"",717.11,26,717.11,1484.51,21,49.43,"",828.64,13,828.64,2313.15,19,48.24,"",897.38,11,897.38,2493.42,21,41.4,"",800.72,14,800.72,3294.14,21,42.1,"",874.58,14,874.58,4168.72,17,38.380000000000003,"",825.16,4,825.16,4993.88,16,45.56,"",771.07,16,771.07,5764.95,16,42.7,"",822.95,14,822.95,6587.9,17,42.34,"",918.98,9,918.98,7506.88,15,43.86,"",822.84,9,822.84,8329.7199999999993,14,47,"",752.34,8,752.34,9082.06,14,51.62,"",791.16,19,791.16,9873.2199999999993,14,46,"",876.52,6,876.52,10749.74,13,"","","","","","","","","","","","","","","","","","","","","","","","","","","","","","","","","","","","","","","","","","","$ER$6:$FE$6",767.4,717.11,828.64,897.38,800.72,874.58,825.16,771.07,822.95,918.98,822.84,752.34,791.16,876.52,0,0,0,0,0,0,"$FM$6:$FZ$6",0,0,0,0,0,0,0,0,0,0,0,0,0,0,0,0,0,0,0,0,"GU6",0,0,0,717.11,717.11,717.11,717.11,717.11,717.11,717.11,717.11,717.11,717.11,717.11,717.11,0,0,0,0,0,10749.74,13,"2"]
[3,"Jon Edison",0,9695.09,27,"12",58.95,"",656.48,24,656.48,656.48,24,60.66,"",704.58,27,704.58,1361.06,28,50.13,"",817.07,15,817.07,2178.13,27,47.76,"",906.4,8,906.4,2428.0500000000002,23,44.6,"",743.27,24,743.27,3171.32,26,49.21,"",748.22,24,748.22,3919.54,27,39.03,"",811.42,6,811.42,4730.96,26,48.44,"",725.22,23,725.22,5456.18,27,48.34,"",726.93,22,726.93,6183.11,26,57.93,"",671.67,27,671.67,6854.78,27,56.61,"",637.51,27,637.51,7511.26,27,58.42,"",605.27,26,605.27,8148.77,27,53.18,"",767.95,22,767.95,8916.7199999999993,27,51.8,"",778.37,18,778.37,9695.09,27,"","","","","","","","","","","","","","","","","","","","","","","","","","","","","","","","","","","","","","","","","","","$ER$7:$FE$7",656.48,704.58,817.07,906.4,743.27,748.22,811.42,725.22,726.93,671.67,637.51,605.27,767.95,778.37,0,0,0,0,0,0,"$FM$7:$FZ$7",0,0,0,0,0,0,0,0,0,0,0,0,0,0,0,0,0,0,0,0,"GU7",0,0,0,656.48,656.48,656.48,656.48,656.48,656.48,656.48,637.51,605.27,605.27,605.27,605.27,0,0,0,0,0,9695.09,27,"12"]
[4,"Mark Treble",0,10934.86,8,"12",50.68,"",763.61,17,763.61,763.61,17,62.66,"",682.09,29,682.09,1445.7,24,49.27,"",831.33,12,831.33,2277.0300000000002,22,46.81,"",924.8,3,924.8,2519.7399999999998,19,41.08,"",806.96,13,806.96,3326.7,18,41.3,"",891.52,10,891.52,4218.22,15,39.89,"",793.93,8,793.93,5012.1499999999996,15,46.91,"",748.88,20,748.88,5761.03,17,36.71,"",957.23,3,957.23,6718.26,12,43.59,"",892.63,13,892.63,7610.89,10,43.11,"",837.16,8,837.16,8448.0499999999993,9,54,"",654.80999999999995,22,654.80999999999995,9130.14,12,50.75,"",804.72,17,804.72,9934.86,12,40.32,"",1000,1,1000,10934.86,8,"","","","","","","","","","","","","","","","","","","","","","","","","","","","","","","","","","","","","","","","","","","$ER$8:$FE$8",763.61,682.09,831.33,924.8,806.96,891.52,793.93,748.88,957.23,892.63,837.16,654.80999999999995,804.72,1000,0,0,0,0,0,0,"$FM$8:$FZ$8",0,0,0,0,0,0,0,0,0,0,0,0,0,0,0,0,0,0,0,0,"GU8",0,0,0,682.09,682.09,682.09,682.09,682.09,682.09,682.09,682.09,654.80999999999995,654.80999999999995,654.80999999999995,654.80999999999995,0,0,0,0,0,10934.86,8,"12"]
[5,"David Rumble",0,10191.530000000001,23,"14",48.38,"",799.91,11,799.91,799.91,11,57.4,"",744.59,23,744.59,1544.5,15,53.28,"",768.76,23,768.76,2313.2600000000002,18,43.29,"",1000,1,1000,2568.67,12,48.16,"",688.33,27,688.33,3313.26,19,44.36,"",830.02,21,830.02,4143.28,19,43.89,"",721.57,16,721.57,4864.8500000000004,19,46.92,"",748.72,21,748.72,5613.57,20,41.94,"",837.86,8,837.86,6451.43,21,56.44,"",689.4,25,689.4,7140.83,23,50.96,"",708.2,25,708.2,7849.03,23,52.4,"",674.8,18,674.8,8537.36,23,41.7,"",979.37,2,979.37,9516.73,22,61.9,"",651.37,27,651.37,10191.530000000001,23,"","","","","","","","","","","","","","","","","","","","","","","","","","","","","","","","","","","","","","","","","","","$ER$9:$FE$9",799.91,744.59,768.76,1000,688.33,830.02,721.57,748.72,837.86,689.4,708.2,674.8,979.37,651.37,0,0,0,0,0,0,"$FM$9:$FZ$9",0,0,0,0,0,0,0,0,0,0,0,0,0,0,0,0,0,0,0,0,"GU9",0,0,0,744.59,688.33,688.33,688.33,688.33,688.33,688.33,688.33,674.8,674.8,651.37,651.37,0,0,0,0,0,10191.530000000001,23,"14"]
[6,"Mark Passingham",0,10540.71,16,"13",47.58,"",813.36,5,813.36,813.36,5,54.28,"",787.39,17,787.39,1600.75,12,50.29,"",814.47,17,814.47,2415.2199999999998,11,48.56,"",891.47,14,891.47,2519.3000000000002,20,38.61,"",858.58,8,858.58,3377.88,12,39.54,"",931.2,8,931.2,4309.08,11,39.270000000000003,"",806.46,7,806.46,5115.54,9,43.89,"",800.41,14,800.41,5915.95,9,41.96,"",837.46,9,837.46,6753.41,8,53.83,"",722.83,24,722.83,7540.8,12,48.4,"",745.66,20,745.66,8286.4599999999991,15,46.15,"",766.19,6,766.19,9052.65,15,62.65,"",651.87,27,651.87,9775.48,16,52.69,"",765.23,21,765.23,10540.71,16,"","","","","","","","","","","","","","","","","","","","","","","","","","","","","","","","","","","","","","","","","","","$ER$10:$FE$10",813.36,787.39,814.47,891.47,858.58,931.2,806.46,800.41,837.46,722.83,745.66,766.19,651.87,765.23,0,0,0,0,0,0,"$FM$10:$FZ$10",0,0,0,0,0,0,0,0,0,0,0,0,0,0,0,0,0,0,0,0,"GU10",0,0,0,787.39,787.39,787.39,787.39,787.39,787.39,722.83,722.83,722.83,651.87,651.87,651.87,0,0,0,0,0,10540.71,16,"13"]
{"$rows_left_out":24}
{"sheet":"Leader Board","index":1,"n_rows":100,"n_cols":5,"rows_kept":100,"cut":false,"hidden":false,"merged":[]}
[{"$f":"99-COUNTIF(Results!B5:B103,\"\")","v":29},"Position","Pilots Name","Total Score","Normalized Score"]
[{"$f":"MATCH(ROW()-1,Results!E$5:E$103,0)","v":20},1,"Joel West",12563.32,1000]
[{"$f":"IF(ISNA(MATCH(ROW()-1,Results!E$5:E$103,0)),MATCH(D2,OFFSET(Results!D$5:D$103,'Leader Board'!A2,0,$A$1),0)+A2,MATCH(ROW()-1,Results!E$5:E$103,0))","v":22},2,"Mark Redsell",11345.49,903.06]
[{"$f":"IF(ISNA(MATCH(ROW()-1,Results!E$5:E$103,0)),MATCH(D3,OFFSET(Results!D$5:D$103,'Leader Board'!A3,0,$A$1),0)+A3,MATCH(ROW()-1,Results!E$5:E$103,0))","v":10},3,"Stefan Bertschi",11254.6,895.83]
[{"$f":"IF(ISNA(MATCH(ROW()-1,Results!E$5:E$103,0)),MATCH(D4,OFFSET(Results!D$5:D$103,'Leader Board'!A4,0,$A$1),0)+A4,MATCH(ROW()-1,Results!E$5:E$103,0))","v":15},4,"Greg Dakin",11208.97,892.19]
[{"$f":"IF(ISNA(MATCH(ROW()-1,Results!E$5:E$103,0)),MATCH(D5,OFFSET(Results!D$5:D$103,'Leader Board'!A5,0,$A$1),0)+A5,MATCH(ROW()-1,Results!E$5:E$103,0))","v":21},5,"Aleix Ingles Elias",11065.74,880.79]
[{"$f":"IF(ISNA(MATCH(ROW()-1,Results!E$5:E$103,0)),MATCH(D6,OFFSET(Results!D$5:D$103,'Leader Board'!A6,0,$A$1),0)+A6,MATCH(ROW()-1,Results!E$5:E$103,0))","v":24},6,"Stefan Bernardy",10973.93,873.48]
[{"$f":"IF(ISNA(MATCH(ROW()-1,Results!E$5:E$103,0)),MATCH(D7,OFFSET(Results!D$5:D$103,'Leader Board'!A7,0,$A$1),0)+A7,MATCH(ROW()-1,Results!E$5:E$103,0))","v":14},7,"Kevin Newton",10959.05,872.3]
[{"$f":"IF(ISNA(MATCH(ROW()-1,Results!E$5:E$103,0)),MATCH(D8,OFFSET(Results!D$5:D$103,'Leader Board'!A8,0,$A$1),0)+A8,MATCH(ROW()-1,Results!E$5:E$103,0))","v":4},8,"Mark Treble",10934.86,870.37]
[{"$f":"IF(ISNA(MATCH(ROW()-1,Results!E$5:E$103,0)),MATCH(D9,OFFSET(Results!D$5:D$103,'Leader Board'!A9,0,$A$1),0)+A9,MATCH(ROW()-1,Results!E$5:E$103,0))","v":12},9,"Graeme Mahoney",10925.77,869.65]
{"$rows_left_out":91}
{"sheet":"Raw Data","index":2,"n_rows":104,"n_cols":43,"rows_kept":104,"cut":false,"hidden":false,"merged":[[101,41,101,42],[102,41,102,42],[103,41,103,42],[101,37,101,38],[102,37,102,38],[103,37,103,38],[101,39,101,40],[102,39,102,40],[103,39,103,40],[101,33,101,34],[102,33,102,34],[103,33,103,34],[101,35,101,36],[102,35,102,36],[103,35,103,36],[101,29,101,30],[102,29,102,30],[103,29,103,30],[101,31,101,32],[102,31,102,32],[103,31,103,32],[101,25,101,26],[102,25,102,26],[103,25,103,26],[101,27,101,28],[102,27,102,28],[103,27,103,28],[101,21,101,22],[102,21,102,22],[103,21,103,22],[101,23,101,24],[102,23,102,24],[103,23,103,24],[101,17,101,18],[102,17,102,18],[103,17,103,18],[101,19,101,20],[102,19,102,20],[103,19,103,20],[101,13,101,14],[102,13,102,14],[103,13,103,14],[101,15,101,16],[102,15,102,16],[103,15,103,16],[103,11,103,12],[103,3,103,4],[103,5,103,6],[103,7,103,8],[103,9,103,10],[101,7,101,8],[102,5,102,6],[102,7,102,8],[101,11,101,12],[102,11,102,12],[101,9,101,10],[102,9,102,10],[101,0,101,2],[102,0,102,2],[103,0,103,2],[101,5,101,6],[101,3,101,4],[102,3,102,4]]}
[null,null,"Discards",0,null,0,null,0,null,1,null,1,null,1,null,1,null,1,null,1,null,1,null,1,null,1,null,1,null,1,null,2,null,2,null,2,null,2,null,2,null,2]
[null,"Pilot","Frequency","Rd1 Time","Rd1 Penalty","Rd2 Time","Rd2 Penalty","Rd3 Time","Rd3 Penalty","Rd4 Time","Rd4 Penalty","Rd5 Time","Rd5 Penalty","Rd6 Time","Rd6 Penalty","Rd7 Time","Rd7 Penalty","Rd8 Time","Rd8 Penalty","Rd9 Time","Rd9 Penalty","Rd10 Time","Rd10 Penalty","Rd11 Time","Rd11 Penalty","Rd12 Time","Rd12 Penalty","Rd13 Time","Rd13 Penalty","Rd14 Time","Rd14 Penalty","Rd15 Time","Rd15 Penalty","Rd16 Time","Rd16 Penalty","Rd17 Time","Rd17 Penalty","Rd18 Time","Rd18 Penalty","Rd19 Time","Rd19 Penalty","Rd20 Time","Rd20 Penalty"]
[1,"Frits Donker Duyvis",0,51.88,null,57.16,null,54.11,null,47.33,null,36.39,null,36.82,null,47.42,null,41.88,null,42.36,null,45.58,null,42.91,null,49.01,null,50.71,null,48.3,0]
[2,"Peter Gunning",0,50.43,null,59.6,null,49.43,null,48.24,null,41.4,null,42.1,null,38.380000000000003,null,45.56,null,42.7,null,42.34,null,43.86,null,47,null,51.62,null,46,0]
[3,"Jon Edison",0,58.95,null,60.66,null,50.13,null,47.76,null,44.6,null,49.21,null,39.03,null,48.44,null,48.34,null,57.93,null,56.61,null,58.42,null,53.18,null,51.8,0]
[4,"Mark Treble",0,50.68,null,62.66,null,49.27,null,46.81,null,41.08,null,41.3,null,39.89,null,46.91,null,36.71,null,43.59,null,43.11,null,54,null,50.75,null,40.32,0]
[5,"David Rumble",0,48.38,null,57.4,null,53.28,null,43.29,null,48.16,null,44.36,null,43.89,null,46.92,null,41.94,null,56.44,null,50.96,null,52.4,null,41.7,null,61.9,0]
[6,"Mark Passingham",0,47.58,null,54.28,null,50.29,null,48.56,null,38.61,null,39.54,null,39.270000000000003,null,43.89,null,41.96,null,53.83,null,48.4,null,46.15,null,62.65,null,52.69,0]
[7,"William Fourie",0,49.01,null,57.42,null,54.81,null,51.2,null,41.75,null,37.39,null,44.22,null,40.17,null,42.44,null,46.85,null,47.84,null,46.51,null,51.35,null,51.55,0]
[8,"Ian Mason",0,49.18,null,58.71,null,50.03,null,53.02,null,47.96,null,41.65,null,48.4,null,44.45,null,42.01,null,56.64,null,48.3,null,48.34,null,50.41,null,49.13,0]
{"$rows_left_out":94}